Announcement

Collapse
No announcement yet.

ftdipty related build error

Collapse
X
  • Filter
  • Time
  • Show
Clear All
new posts

  • ftdipty related build error

    I tried building everything from trunk (r326) and got the following error at the end:

    Undefined symbols:
    "_ptsname_r", referenced from:
    _main in ftdipty.c.o
    ld: symbol(s) not found
    collect2: ld returned 1 exit status
    make[2]: *** [../bin/obdftdipty] Error 1
    make[1]: *** [src/ftdipty/CMakeFiles/obdftdipty.dir/all] Error 2
    make: *** [all] Error 2


    OS X 10.5.8 PPC Xcode tools 3.1.4
    I removed fdtipty from the build and everything else built and installed fine.
    Just informing you of the build error

  • #2
    ... man, I even checked for that, but only in obdsim [not obdftdipty].

    Guess I've never compiled obdftdipty on OSX [oops]

    I've committed the fix. If you try it please let me know if it worked [no reason it shouldn't, but...]

    Thanks!
    Gary (-;
    OBDGPSLogger, for logging OBDII and/or GPS data
    OBDSim, an OBDII/ELM327 software simulator
    mp3car forums: obdgpslogger, obdsim

    Comment


    • #3
      Pulled r327, rebuilt and installed, everything compiled fine.

      Comment


      • #4
        Yay!

        Thanks for letting me know about the bug and checking the fix. Please don't hesitate to ask if you have any other questions, or success stories, or anything!

        Gary (-;
        OBDGPSLogger, for logging OBDII and/or GPS data
        OBDSim, an OBDII/ELM327 software simulator
        mp3car forums: obdgpslogger, obdsim

        Comment

        Working...
        X