Results 1 to 4 of 4

Thread: ftdipty related build error

  1. #1
    Newbie
    Join Date
    Dec 2009
    Posts
    2

    ftdipty related build error

    I tried building everything from trunk (r326) and got the following error at the end:

    Undefined symbols:
    "_ptsname_r", referenced from:
    _main in ftdipty.c.o
    ld: symbol(s) not found
    collect2: ld returned 1 exit status
    make[2]: *** [../bin/obdftdipty] Error 1
    make[1]: *** [src/ftdipty/CMakeFiles/obdftdipty.dir/all] Error 2
    make: *** [all] Error 2


    OS X 10.5.8 PPC Xcode tools 3.1.4
    I removed fdtipty from the build and everything else built and installed fine.
    Just informing you of the build error

  2. #2
    SuperMod - OBDII GPS Logger forum
    Auto Apps:loading...

    Join Date
    Mar 2009
    Location
    Los Angeles
    Posts
    924
    ... man, I even checked for that, but only in obdsim [not obdftdipty].

    Guess I've never compiled obdftdipty on OSX [oops]

    I've committed the fix. If you try it please let me know if it worked [no reason it shouldn't, but...]

    Thanks!
    Gary (-;
    OBDGPSLogger, for logging OBDII and/or GPS data
    OBDSim, an OBDII/ELM327 software simulator
    mp3car forums: obdgpslogger, obdsim

  3. #3
    Newbie
    Join Date
    Dec 2009
    Posts
    2
    Pulled r327, rebuilt and installed, everything compiled fine.

  4. #4
    SuperMod - OBDII GPS Logger forum
    Auto Apps:loading...

    Join Date
    Mar 2009
    Location
    Los Angeles
    Posts
    924
    Yay!

    Thanks for letting me know about the bug and checking the fix. Please don't hesitate to ask if you have any other questions, or success stories, or anything!

    Gary (-;
    OBDGPSLogger, for logging OBDII and/or GPS data
    OBDSim, an OBDII/ELM327 software simulator
    mp3car forums: obdgpslogger, obdsim

Similar Threads

  1. Virtual Earth cache builder? Or even gps simulator to make it cache?
    By thepunkerguy in forum DigitalMods (Scripts / API)
    Replies: 183
    Last Post: 08-28-2008, 09:58 PM
  2. MCI error 261 and 263
    By genesis66 in forum Road Runner
    Replies: 2
    Last Post: 12-21-2007, 02:59 PM
  3. Centrafuse 1.42 Update
    By veetid in forum Centrafuse
    Replies: 37
    Last Post: 11-25-2007, 04:41 PM
  4. RR Config.exe and Radioshark error in latest build
    By Firebird2 in forum Road Runner
    Replies: 0
    Last Post: 09-10-2007, 05:53 PM
  5. Replies: 7
    Last Post: 07-01-2005, 04:29 PM

Bookmarks

Posting Permissions

  • You may not post new threads
  • You may not post replies
  • You may not post attachments
  • You may not edit your posts
  •